Target
5-hydroxytryptamine receptor 7
Ligand
BDBM50015197
Substrate
Meas. Tech.
ChEMBL_1349441 (CHEMBL3270392)
Ki
8.1±n/a nM
Citation
 Spadoni, GBedini, ABartolucci, SPala, DMor, MRiccioni, TBorsini, FCabri, WCelona, DMarzi, MTarzia, GRivara, SMinetti, P Towards the development of 5-HT7 ligands combining serotonin-like and arylpiperazine moieties. Eur J Med Chem 80:8-35 (2014)  
Target
Name:
5-hydroxytryptamine receptor 7
Synonyms:
5-HT-7 5-HT7 5-HT7S 5HT7 HTR7 | Serotonin receptor 7
Type:
G Protein-Coupled Receptor (GPCR)
Mol. Mass.:
53573.08
Organism:
Homo sapiens (Human)
Description:
P34969
Residue:
479
  
Inhibitor
Name:
BDBM50015197
Synonyms:
CHEMBL3262432
Type:
Small organic molecule
Emp. Form.:
C27H34ClN3O2
Mol. Mass.:
468.031
SMILES:
Cl.CN(C(=O)CCCCCN1CCN(CC1)c1cccc2ccccc12)c1cccc(O)c1
: