Target
Proteasome subunit beta type-7
Ligand
BDBM50015246
Substrate
Meas. Tech.
ChEMBL_1349633 (CHEMBL3266057)
IC50
170±n/a nM
Citation
 Zhang, JCao, JXu, LZhou, YLiu, TLi, JHu, Y Design, synthesis and biological evaluation of novel tripeptidyl epoxyketone derivatives constructed fromß-amino acid as proteasome inhibitors. Bioorg Med Chem 22:2955-65 (2014)  
Target
Name:
Proteasome subunit beta type-7
Synonyms:
Macropain chain Z PSB7_HUMAN Proteasome subunit Z | Z
Type:
PROTEIN
Mol. Mass.:
29968.13
Organism:
Homo sapiens (Human)
Description:
ChEMBL_106197
Residue:
277
  
Inhibitor
Name:
BDBM50015246
Synonyms:
CHEMBL3262765
Type:
Small organic molecule
Emp. Form.:
C35H38F3N3O5
Mol. Mass.:
637.6885
SMILES:
CC(C)C[C@H](NC(=O)[C@H](Cc1ccccc1)NC(=O)C[C@@H](NC(=O)c1ccc(cc1)C(F)(F)F)c1ccccc1)C(=O)[C@@]1(C)CO1
: