Target
Bromodomain-containing protein 4
Ligand
BDBM50015249
Substrate
Meas. Tech.
ChEMBL_1349750 (CHEMBL3267582)
IC50
7500±n/a nM
Citation
 Zhao, HGartenmann, LDong, JSpiliotopoulos, DCaflisch, A Discovery of BRD4 bromodomain inhibitors by fragment-based high-throughput docking. Bioorg Med Chem Lett 24:2493-6 (2014)  
Target
Name:
Bromodomain-containing protein 4
Synonyms:
BRD4 Bromodomain-containing protein 4 (BRD4) Protein HUNK1
Type:
Protein
Mol. Mass.:
152264.84
Organism:
Homo sapiens (Human)
Description:
O60885
Residue:
1362
  
Inhibitor
Name:
BDBM50015249
Synonyms:
CHEMBL1620811
Type:
Small organic molecule
Emp. Form.:
C16H16N2O
Mol. Mass.:
252.311
SMILES:
CN1c2ccccc2NC(CC1=O)c1ccccc1
: