Target
Bile acid receptor
Ligand
BDBM50015405
Substrate
Meas. Tech.
ChEMBL_1348162 (CHEMBL3269921)
IC50
1240±n/a nM
Citation
 Yu, DDLin, WForman, BMChen, T Identification of trisubstituted-pyrazol carboxamide analogs as novel and potent antagonists of farnesoid X receptor. Bioorg Med Chem 22:2919-38 (2014)  
Target
Name:
Bile acid receptor
Synonyms:
BAR FXR HRR1 NR1H4_HUMAN RIP14 Retinoid X receptor-interacting protein 14 | farnesoid x receptor
Type:
Nuclear Receptor
Mol. Mass.:
55916.24
Organism:
Homo sapiens (Human)
Description:
Q96RI1
Residue:
486
  
Inhibitor
Name:
BDBM50015405
Synonyms:
CHEMBL3264637
Type:
Small organic molecule
Emp. Form.:
C28H26Cl2N4O4S
Mol. Mass.:
585.501
SMILES:
Cc1ccc(cc1)-c1nn(cc1C(=O)Nc1ccc(C)c(c1)S(=O)(=O)N1CCOCC1)-c1ccc(Cl)cc1Cl
: