Target
Tyrosine-protein kinase SYK
Ligand
BDBM50015450
Substrate
Meas. Tech.
ChEMBL_1348181 (CHEMBL3270296)
IC50
3.8±n/a nM
Citation
 Currie, KSKropf, JELee, TBlomgren, PXu, JZhao, ZGallion, SWhitney, JAMaclin, DLansdon, EBMaciejewski, PRossi, AMRong, HMacaluso, JBarbosa, JDi Paolo, JAMitchell, SA Discovery of GS-9973, a selective and orally efficacious inhibitor of spleen tyrosine kinase. J Med Chem 57:3856-73 (2014)  
Target
Name:
Tyrosine-protein kinase SYK
Synonyms:
KSYK_HUMAN Spleen Tyrosine Kinase Tyrosine-protein kinase SYK (Syk)
Type:
Enzyme
Mol. Mass.:
72079.99
Organism:
Homo sapiens (Human)
Description:
P43405
Residue:
635
  
Inhibitor
Name:
BDBM50015450
Synonyms:
CHEMBL3265034
Type:
Small organic molecule
Emp. Form.:
C24H22N6O
Mol. Mass.:
410.4711
SMILES:
C1CC(CCO1)c1ccc(Nc2nc(cn3ccnc23)-c2ccc3cn[nH]c3c2)cc1
: