Target
Cytochrome P450 2D6
Ligand
BDBM50015547
Substrate
Meas. Tech.
ChEMBL_1348413 (CHEMBL3265966)
IC50
1100±n/a nM
Citation
 Volgraf, MChan, LHuestis, MPPurkey, HEBurkard, MGeck Do, MHarris, JHunt, KWLiu, XLyssikatos, JPRana, SThomas, AAVigers, GPSiu, M Synthesis, characterization, and PK/PD studies of a series of spirocyclic pyranochromene BACE1 inhibitors. Bioorg Med Chem Lett 24:2477-80 (2014)  
Target
Name:
Cytochrome P450 2D6
Synonyms:
CP2D6_HUMAN CYP2DL1 Cytochrome P450 2D6 (CYP2D6) P450-DB1
Type:
Protein
Mol. Mass.:
55774.82
Organism:
Homo sapiens (Human)
Description:
P10635
Residue:
497
  
Inhibitor
Name:
BDBM50015547
Synonyms:
CHEMBL3265335
Type:
Small organic molecule
Emp. Form.:
C19H18ClN3O3
Mol. Mass.:
371.818
SMILES:
[H][C@]12COCC[C@]1([H])[C@]1(COC(N)=N1)c1cc(ccc1O2)-c1cncc(Cl)c1
: