Target
Cholinesterase
Ligand
BDBM50004000
Substrate
Meas. Tech.
ChEMBL_1348900 (CHEMBL3271169)
IC50
930±n/a nM
Citation
 Jabeen, FOliferenko, PVOliferenko, AAPillai, GGAnsari, FLHall, CDKatritzky, AR Dual inhibition of thea-glucosidase and butyrylcholinesterase studied by molecular field topology analysis. Eur J Med Chem 80:228-42 (2014)  
Target
Name:
Cholinesterase
Synonyms:
Acylcholine acylhydrolase Butyrylcholine esterase (BChE) Butyrylcholinesterase (BuChE) CHLE_HUMAN Cholinesterases Pseudocholinesterase
Type:
Homotetramer
Mol. Mass.:
68422.27
Organism:
Homo sapiens (Human)
Description:
P06276
Residue:
602
  
Inhibitor
Name:
BDBM50004000
Synonyms:
(3aS,8aR)-1,3a,8-trimethyl-1,2,3,3a,8,8a-hexahydropyrrolo[2,3-b]indol-5-yl methylcarbamate CHEMBL94 Physostol | physostigmine
Type:
Small organic molecule
Emp. Form.:
C15H21N3O2
Mol. Mass.:
275.3461
SMILES:
CNC(=O)Oc1ccc2N(C)[C@H]3N(C)CC[C@@]3(C)c2c1
: