Target
Cytochrome P450 1A2
Ligand
BDBM50015639
Substrate
Meas. Tech.
ChEMBL_1349490 (CHEMBL3270809)
IC50
>10000±n/a nM
Citation
 Jin, CHKrishnaiah, MSreenu, DSubrahmanyam, VBRao, KSLee, HJPark, SJPark, HJLee, KSheen, YYKim, DK Discovery of N-((4-([1,2,4]triazolo[1,5-a]pyridin-6-yl)-5-(6-methylpyridin-2-yl)-1H-imidazol-2-yl)methyl)-2-fluoroaniline (EW-7197): a highly potent, selective, and orally bioavailable inhibitor of TGF-ß type I receptor kinase as cancer immunotherapeutic/antifibrotic agent. J Med Chem 57:4213-38 (2014)  
Target
Name:
Cytochrome P450 1A2
Synonyms:
CP1A2_HUMAN CYPIA2 Cytochrome P(3)450 Cytochrome P450 1A2 (CYP1A2) Cytochrome P450-P3
Type:
Enzyme
Mol. Mass.:
58423.38
Organism:
Homo sapiens (Human)
Description:
P05177
Residue:
516
  
Inhibitor
Name:
BDBM50015639
Synonyms:
CHEMBL3260567 | USRE47141, Example 2
Type:
Small organic molecule
Emp. Form.:
C22H18FN7
Mol. Mass.:
399.4236
SMILES:
Cc1cccc(n1)-c1[nH]c(CNc2ccccc2F)nc1-c1ccc2ncnn2c1
: