Target
Hepatocyte growth factor receptor
Ligand
BDBM50015963
Substrate
Meas. Tech.
ChEMBL_1349818 (CHEMBL3268019)
IC50
166±n/a nM
Citation
 Zhang, WAi, JShi, DPeng, XJi, YLiu, JGeng, MLi, Y Discovery of novel type II c-Met inhibitors based on BMS-777607. Eur J Med Chem 80:254-66 (2014)  
Target
Name:
Hepatocyte growth factor receptor
Synonyms:
Hepatocyte growth factor receptor Hepatocyte growth factor receptor (c-MET) MET Met proto-oncogene (hepatocyte growth factor receptor) Tyrosine-protein kinase Met (c-Met) c-Met kinase
Type:
Protein
Mol. Mass.:
155559.73
Organism:
Homo sapiens (Human)
Description:
P08581
Residue:
1390
  
Inhibitor
Name:
BDBM50015963
Synonyms:
CHEMBL3260952
Type:
Small organic molecule
Emp. Form.:
C23H22ClFN4O4S
Mol. Mass.:
504.962
SMILES:
Cc1ccc(cc1)N1CCCC(C(=O)Nc2ccc(Oc3ccnc(N)c3Cl)c(F)c2)S1(=O)=O
: