Target
Hepatocyte growth factor receptor
Ligand
BDBM50015966
Substrate
Meas. Tech.
ChEMBL_1349816 (CHEMBL3268017)
IC50
27±n/a nM
Citation
 Zhang, WAi, JShi, DPeng, XJi, YLiu, JGeng, MLi, Y Discovery of novel type II c-Met inhibitors based on BMS-777607. Eur J Med Chem 80:254-66 (2014)  
Target
Name:
Hepatocyte growth factor receptor
Synonyms:
Hepatocyte growth factor receptor Hepatocyte growth factor receptor (c-MET) MET Met proto-oncogene (hepatocyte growth factor receptor) Tyrosine-protein kinase Met (c-Met) c-Met kinase
Type:
Protein
Mol. Mass.:
155559.73
Organism:
Homo sapiens (Human)
Description:
P08581
Residue:
1390
  
Inhibitor
Name:
BDBM50015966
Synonyms:
CHEMBL3260969
Type:
Small organic molecule
Emp. Form.:
C28H22F2N6O2S2
Mol. Mass.:
576.64
SMILES:
CCn1cnc(c1)-c1cc2nccc(Oc3ccc(NC(=S)N4CCN(C4=O)c4ccc(F)cc4)cc3F)c2s1
: