Target
Focal adhesion kinase 1
Ligand
BDBM50016095
Substrate
Meas. Tech.
ChEMBL_1349847 (CHEMBL3268423)
IC50
450±n/a nM
Citation
 Duan, YTYao, YFHuang, WMakawana, JATeraiya, SBThumar, NJTang, DJTao, XXWang, ZCJiang, AQZhu, HL Synthesis, biological evaluation, and molecular docking studies of novel 2-styryl-5-nitroimidazole derivatives containing 1,4-benzodioxan moiety as FAK inhibitors with anticancer activity. Bioorg Med Chem 22:2947-54 (2014)  
Target
Name:
Focal adhesion kinase 1
Synonyms:
FADK 1 FAK1 FLT4 Focal adhesion kinase (FAK) Focal adhesion kinase 1 (FAK) Focal adhesion kinase-related nonkinase PTK2 Protein-tyrosine kinase 2 p125FAK | pp125FAK
Type:
Tyrosine-protein kinase
Mol. Mass.:
119233.17
Organism:
Homo sapiens (Human)
Description:
Q05397
Residue:
1052
  
Inhibitor
Name:
BDBM50016095
Synonyms:
CHEMBL3261192
Type:
Small organic molecule
Emp. Form.:
C22H17ClFN3O6
Mol. Mass.:
473.838
SMILES:
[O-][N+](=O)c1cnc(\C=C/c2c(F)cccc2Cl)n1CCOC(=O)c1cccc2OCCOc12
: