Target
Cell division cycle 7-related protein kinase/Protein DBF4 homolog A
Ligand
BDBM50016163
Substrate
Meas. Tech.
ChEMBL_1350355 (CHEMBL3268449)
IC50
29±n/a nM
Citation
 Reichelt, ABailis, JMBartberger, MDYao, GShu, HKaller, MRAllen, JGWeidner, MFKeegan, KSDao, JH Synthesis and structure-activity relationship of trisubstituted thiazoles as Cdc7 kinase inhibitors. Eur J Med Chem 80:364-82 (2014)  
Target
Name:
Cell division cycle 7-related protein kinase/Protein DBF4 homolog A
Synonyms:
Activator of S phase kinase DBF4/Cell division cycle 7-related protein kinase CDC7/DBF4 (Cell division cycle 7-related protein kinase/Activator of S phase kinase)
Type:
Protein
Mol. Mass.:
Description:
Components:
This complex has 2 components.
Component 1
Name:
Protein DBF4 homolog A
Synonyms:
ASK Chiffon homolog A DBF4-type zinc finger-containing protein 1 DBF4A_HUMAN ZDBF1
Type:
Regulatory subunit
Mol. Mass.:
76869.65
Organism:
Homo sapiens (Human)
Description:
Residue:
674
  
Component 2
Name:
Cell division cycle 7-related protein kinase
Synonyms:
CDC7 CDC7L1 Cell division cycle 7-related protein kinase (CDC7) huCdc7
Type:
Protein
Mol. Mass.:
63908.16
Organism:
Homo sapiens (Human)
Description:
O00311
Residue:
574
  
Inhibitor
Name:
BDBM50016163
Synonyms:
CHEMBL3261514
Type:
Small organic molecule
Emp. Form.:
C14H9Cl2N5OS
Mol. Mass.:
366.225
SMILES:
NC(=O)c1sc(nc1-c1ccc(Cl)cc1Cl)-c1ccnc(N)n1
: