Target
Tyrosyl-DNA phosphodiesterase 1
Ligand
BDBM50016174
Substrate
Meas. Tech.
ChEMBL_1350864 (CHEMBL3267292)
IC50
37000±n/a nM
Citation
 Lv, PCAgama, KMarchand, CPommier, YCushman, M Design, synthesis, and biological evaluation of O-2-modified indenoisoquinolines as dual topoisomerase I-tyrosyl-DNA phosphodiesterase I inhibitors. J Med Chem 57:4324-36 (2014)  
Target
Name:
Tyrosyl-DNA phosphodiesterase 1
Synonyms:
TDP1 Tyrosyl-DNA phosphodiesterase 1 | Tyrosyl-DNA phosphodiesterase 1 (TDP1)
Type:
Enzyme
Mol. Mass.:
68430.66
Organism:
Homo sapiens (Human)
Description:
Q9NUW8
Residue:
608
  
Inhibitor
Name:
BDBM50016174
Synonyms:
CHEMBL3261812
Type:
Small organic molecule
Emp. Form.:
C28H32ClN3O7
Mol. Mass.:
558.023
SMILES:
Cl.COc1cc2c(cc1OCCCN)c1C(=O)c3cc4OCOc4cc3-c1n(CCCN1CCOCC1)c2=O
: