Target
Neuronal acetylcholine receptor subunit alpha-7
Ligand
BDBM50016208
Substrate
Meas. Tech.
ChEMBL_1348013 (CHEMBL3268312)
IC50
37±n/a nM
Citation
 Clark, RBLamppu, DLibertine, LMcDonough, AKumar, ALaRosa, GRush, RElbaum, D Discovery of novel 2-((pyridin-3-yloxy)methyl)piperazines asa7 nicotinic acetylcholine receptor modulators for the treatment of inflammatory disorders. J Med Chem 57:3966-83 (2014)  
Target
Name:
Neuronal acetylcholine receptor subunit alpha-7
Synonyms:
ACHA7_RAT Cholinergic, Nicotinic Alpha7 Chrna7 Neuronal acetylcholine receptor (alpha7 nAChR) Neuronal acetylcholine receptor subunit alpha-7 Neuronal acetylcholine receptor subunit alpha-7 (nAChR)
Type:
Enzyme
Mol. Mass.:
56502.44
Organism:
Rattus norvegicus (Rat)
Description:
Q05941
Residue:
502
  
Inhibitor
Name:
BDBM50016208
Synonyms:
CHEMBL3262154
Type:
Small organic molecule
Emp. Form.:
C17H20ClN3O3
Mol. Mass.:
349.812
SMILES:
Cl.O=C(Oc1ccccc1)N1CCNCC1COc1cccnc1
: