Target
Neuronal acetylcholine receptor subunit alpha-7
Ligand
BDBM50016222
Substrate
Meas. Tech.
ChEMBL_1348013 (CHEMBL3268312)
IC50
45±n/a nM
Citation
 Clark, RBLamppu, DLibertine, LMcDonough, AKumar, ALaRosa, GRush, RElbaum, D Discovery of novel 2-((pyridin-3-yloxy)methyl)piperazines asa7 nicotinic acetylcholine receptor modulators for the treatment of inflammatory disorders. J Med Chem 57:3966-83 (2014)  
Target
Name:
Neuronal acetylcholine receptor subunit alpha-7
Synonyms:
ACHA7_RAT Cholinergic, Nicotinic Alpha7 Chrna7 Neuronal acetylcholine receptor (alpha7 nAChR) Neuronal acetylcholine receptor subunit alpha-7 Neuronal acetylcholine receptor subunit alpha-7 (nAChR)
Type:
Enzyme
Mol. Mass.:
56502.44
Organism:
Rattus norvegicus (Rat)
Description:
Q05941
Residue:
502
  
Inhibitor
Name:
BDBM50016222
Synonyms:
CHEMBL3262168
Type:
Small organic molecule
Emp. Form.:
C18H22Cl2N4O3
Mol. Mass.:
413.298
SMILES:
Cl.COc1ccc(NC(=O)N2CCNCC2COc2cccnc2)cc1Cl
: