Target
Prostaglandin G/H synthase 2
Ligand
BDBM50016429
Substrate
Meas. Tech.
ChEMBL_1347550 (CHEMBL3269085)
IC50
3980±n/a nM
Citation
 Haider, SAlam, MSHamid, HShafi, SDhulap, AHussain, FAlam, PUmar, SPasha, MABano, SNazreen, SAli, YKharbanda, C Synthesis of novel 2-mercaptobenzoxazole based 1,2,3-triazoles as inhibitors of proinflammatory cytokines and suppressors of COX-2 gene expression. Eur J Med Chem 81:204-17 (2014)  
Target
Name:
Prostaglandin G/H synthase 2
Synonyms:
COX2 Cyclooxygenase 2 (COX-2) Cyclooxygenase-2 (COX-2 AA) Cyclooxygenase-2 (COX-2) PGH2_HUMAN PHS II Prostaglandin E synthase/G/H synthase 2 Prostaglandin-endoperoxide synthase 2
Type:
Enzyme
Mol. Mass.:
69003.89
Organism:
Homo sapiens (Human)
Description:
Recombinant Cox-2 provided by Cayman (Cayman Chemical Co.,Ann Arbor, MI).
Residue:
604
  
Inhibitor
Name:
BDBM50016429
Synonyms:
CHEMBL3264703
Type:
Small organic molecule
Emp. Form.:
C15H11N5OS
Mol. Mass.:
309.346
SMILES:
C(Sc1nc2ccccc2o1)c1cn(nn1)-c1cccnc1
: