Target
Prostaglandin G/H synthase 1
Ligand
BDBM50016401
Substrate
Meas. Tech.
ChEMBL_1347549 (CHEMBL3269084)
IC50
24230±n/a nM
Citation
 Haider, SAlam, MSHamid, HShafi, SDhulap, AHussain, FAlam, PUmar, SPasha, MABano, SNazreen, SAli, YKharbanda, C Synthesis of novel 2-mercaptobenzoxazole based 1,2,3-triazoles as inhibitors of proinflammatory cytokines and suppressors of COX-2 gene expression. Eur J Med Chem 81:204-17 (2014)  
Target
Name:
Prostaglandin G/H synthase 1
Synonyms:
COX-1 Cyclooxygenase Cyclooxygenase-1 (COX-1) PTGS1 | Prostaglandin G/H synthase (cyclooxygenase)
Type:
Enzyme
Mol. Mass.:
68692.62
Organism:
Homo sapiens (Human)
Description:
P23219
Residue:
599
  
Inhibitor
Name:
BDBM50016401
Synonyms:
CHEMBL3264699
Type:
Small organic molecule
Emp. Form.:
C16H11FN4OS
Mol. Mass.:
326.348
SMILES:
Fc1ccccc1-n1cc(CSc2nc3ccccc3o2)nn1
: