Target
Glandular kallikrein
Ligand
BDBM50016523
Substrate
Meas. Tech.
ChEMBL_1354676 (CHEMBL3281101)
Ki
11400±n/a nM
Citation
 Geratz, JDCheng, MCTidwell, RR Novel bis(benzamidino) compounds with an aromatic central link. Inhibitors of thrombin, pancreatic kallikrein, trypsin, and complement. J Med Chem 19:634-9 (1976)  
Target
Name:
Glandular kallikrein
Synonyms:
KLK_PIG | Tissue kallikrein
Type:
PROTEIN
Mol. Mass.:
26710.38
Organism:
Sus scrofa
Description:
ChEMBL_108296
Residue:
242
  
Inhibitor
Name:
BDBM50016523
Synonyms:
CHEMBL3277918
Type:
Small organic molecule
Emp. Form.:
C22H23ClN4O2
Mol. Mass.:
410.897
SMILES:
Cl.NC(=N)c1ccc(OCc2ccc(COc3ccc(cc3)C(N)=N)cc2)cc1
: