Target
Glandular kallikrein
Ligand
BDBM50016532
Substrate
Meas. Tech.
ChEMBL_1354676 (CHEMBL3281101)
Ki
5500±n/a nM
Citation
 Geratz, JDCheng, MCTidwell, RR Novel bis(benzamidino) compounds with an aromatic central link. Inhibitors of thrombin, pancreatic kallikrein, trypsin, and complement. J Med Chem 19:634-9 (1976)  
Target
Name:
Glandular kallikrein
Synonyms:
KLK_PIG | Tissue kallikrein
Type:
PROTEIN
Mol. Mass.:
26710.38
Organism:
Sus scrofa
Description:
ChEMBL_108296
Residue:
242
  
Inhibitor
Name:
BDBM50016532
Synonyms:
CHEMBL3277929
Type:
Small organic molecule
Emp. Form.:
C26H25ClN4O2
Mol. Mass.:
460.955
SMILES:
Cl.NC(=N)c1cccc(COc2ccc3cc(OCc4cccc(c4)C(N)=N)ccc3c2)c1
: