Target
Sodium-dependent dopamine transporter
Ligand
BDBM50005246
Substrate
Meas. Tech.
ChEMBL_1356560 (CHEMBL3286059)
IC50
960±n/a nM
Citation
 Tuomisto, JTuomisto, LPazdernik, TL Conformationally rigid amphetamine analogs as inhibitors of monoamine uptake by brain synaptosomes. J Med Chem 19:725-7 (1976)  
Target
Name:
Sodium-dependent dopamine transporter
Synonyms:
DA transporter SC6A3_RAT Sodium-dependent dopamine transporter | Sodium-dependent dopamine transporter (DAT)
Type:
Multi-pass membrane protein
Mol. Mass.:
68749.45
Organism:
Rattus norvegicus (rat)
Description:
P23977
Residue:
619
  
Inhibitor
Name:
BDBM50005246
Synonyms:
1-Phenylpropan-2-amin 1-phenylpropan-2-amine AMPHETAMINE Amfetamine DEXTROAMP SACCHARATE alpha-methylphenylethylamine beta-Phenylisopropylamin beta-phenylisopropylamine | desoxynorephedrine
Type:
Small organic molecule
Emp. Form.:
C9H13N
Mol. Mass.:
135.2062
SMILES:
CC(N)Cc1ccccc1
: