Target
Xanthine dehydrogenase/oxidase
Ligand
BDBM50016697
Substrate
Meas. Tech.
ChEMBL_1354805 (CHEMBL3279106)
Ki
13±n/a nM
Citation
 Springer, RHDimmitt, MKNovinson, TO'Brien, DERobins, RKSimon, LNMiller, JP Synthesis and enzymic activity of some novel xanthine oxidase inhibitors. 3-Substituted 5,7-dihydroxypyrazolo(1,5-alpha)pyrimidines. J Med Chem 19:291-6 (1976)  
Target
Name:
Xanthine dehydrogenase/oxidase
Synonyms:
XDH Xanthine dehydrogenase Xanthine oxidase (XO)
Type:
Protein
Mol. Mass.:
146809.00
Organism:
Bos taurus (Bovine)
Description:
P80457
Residue:
1332
  
Inhibitor
Name:
BDBM50016697
Synonyms:
CHEMBL3277223
Type:
Small organic molecule
Emp. Form.:
C16H11N3O2
Mol. Mass.:
277.2774
SMILES:
Oc1cc(O)n2ncc(-c3cccc4ccccc34)c2n1
: