Target
Xanthine dehydrogenase/oxidase
Ligand
BDBM50016699
Substrate
Meas. Tech.
ChEMBL_1354806 (CHEMBL3279107)
Ki
26±n/a nM
Citation
 Springer, RHDimmitt, MKNovinson, TO'Brien, DERobins, RKSimon, LNMiller, JP Synthesis and enzymic activity of some novel xanthine oxidase inhibitors. 3-Substituted 5,7-dihydroxypyrazolo(1,5-alpha)pyrimidines. J Med Chem 19:291-6 (1976)  
Target
Name:
Xanthine dehydrogenase/oxidase
Synonyms:
XDH Xanthine dehydrogenase Xanthine oxidase (XO)
Type:
Protein
Mol. Mass.:
146809.00
Organism:
Bos taurus (Bovine)
Description:
P80457
Residue:
1332
  
Inhibitor
Name:
BDBM50016699
Synonyms:
CHEMBL3276841
Type:
Small organic molecule
Emp. Form.:
C12H8BrN3O2
Mol. Mass.:
306.115
SMILES:
Oc1cc(O)n2ncc(-c3ccc(Br)cc3)c2n1
: