Target
Xanthine dehydrogenase/oxidase
Ligand
BDBM50016784
Substrate
Meas. Tech.
ChEMBL_1354806 (CHEMBL3279107)
Ki
1000±n/a nM
Citation
 Springer, RHDimmitt, MKNovinson, TO'Brien, DERobins, RKSimon, LNMiller, JP Synthesis and enzymic activity of some novel xanthine oxidase inhibitors. 3-Substituted 5,7-dihydroxypyrazolo(1,5-alpha)pyrimidines. J Med Chem 19:291-6 (1976)  
Target
Name:
Xanthine dehydrogenase/oxidase
Synonyms:
XDH Xanthine dehydrogenase Xanthine oxidase (XO)
Type:
Protein
Mol. Mass.:
146809.00
Organism:
Bos taurus (Bovine)
Description:
P80457
Residue:
1332
  
Inhibitor
Name:
BDBM50016784
Synonyms:
ALLOPURINOL BW-56158 Lopurin US9428466, Allopurinol | Zyloprim
Type:
Small organic molecule
Emp. Form.:
C5H4N4O
Mol. Mass.:
136.1115
SMILES:
O=c1ncnc2[nH][nH]cc12
: