Target
Acetylcholinesterase
Ligand
BDBM50016848
Substrate
Meas. Tech.
ChEMBL_1355049 (CHEMBL3280463)
Ki
2.1±n/a nM
Citation
 Chen, WSCocolas, GHCavallito, CJChai, KJ Potent reversible anticholinesterase agents. Bis- and mono-N-substituted benzoquinolinium halides. J Med Chem 20:1617-23 (1978)  
Target
Name:
Acetylcholinesterase
Synonyms:
ACES_ELEEL Acetylcholinesterase (EeAChE) | ache
Type:
Enzyme
Mol. Mass.:
71812.79
Organism:
Electrophorus electricus (Electric eel)
Description:
Residue:
633
  
Inhibitor
Name:
BDBM50016848
Synonyms:
CHEMBL3276408
Type:
Small organic molecule
Emp. Form.:
C32H30I2N2
Mol. Mass.:
696.4029
SMILES:
[I-].[I-].C(CCC[n+]1c2ccccc2cc2ccccc12)CC[n+]1c2ccccc2cc2ccccc12
: