Target
Acetylcholinesterase
Ligand
BDBM50016849
Substrate
Meas. Tech.
ChEMBL_1355050 (CHEMBL3280464)
Ki
6.6±n/a nM
Citation
 Chen, WSCocolas, GHCavallito, CJChai, KJ Potent reversible anticholinesterase agents. Bis- and mono-N-substituted benzoquinolinium halides. J Med Chem 20:1617-23 (1978)  
Target
Name:
Acetylcholinesterase
Synonyms:
ACES_ELEEL Acetylcholinesterase (EeAChE) | ache
Type:
Enzyme
Mol. Mass.:
71812.79
Organism:
Electrophorus electricus (Electric eel)
Description:
Residue:
633
  
Inhibitor
Name:
BDBM50016849
Synonyms:
CHEMBL3276410
Type:
Small organic molecule
Emp. Form.:
C32H30Br2N2
Mol. Mass.:
602.402
SMILES:
[Br-].[Br-].C(CCC[n+]1cc2ccccc2c2ccccc12)CC[n+]1cc2ccccc2c2ccccc12
: