Target
Acetylcholinesterase
Ligand
BDBM50016875
Substrate
Meas. Tech.
ChEMBL_1355054 (CHEMBL3280468)
Ki
21±n/a nM
Citation
 Chen, WSCocolas, GHCavallito, CJChai, KJ Potent reversible anticholinesterase agents. Bis- and mono-N-substituted benzoquinolinium halides. J Med Chem 20:1617-23 (1978)  
Target
Name:
Acetylcholinesterase
Synonyms:
ACES_ELEEL Acetylcholinesterase (EeAChE) | ache
Type:
Enzyme
Mol. Mass.:
71812.79
Organism:
Electrophorus electricus (Electric eel)
Description:
Residue:
633
  
Inhibitor
Name:
BDBM50016875
Synonyms:
CHEMBL3276431
Type:
Small organic molecule
Emp. Form.:
C17H16BrNO2
Mol. Mass.:
346.218
SMILES:
[Br-].CC(=O)OCC[n+]1c2ccccc2cc2ccccc12
: