Target
Prostaglandin E2 receptor EP2 subtype
Ligand
BDBM50016954
Substrate
Meas. Tech.
ChEMBL_1364371 (CHEMBL3294240)
Ki
73±n/a nM
Citation
 Ganesh, T Prostanoid receptor EP2 as a therapeutic target. J Med Chem 57:4454-65 (2014)  
Target
Name:
Prostaglandin E2 receptor EP2 subtype
Synonyms:
PE2R2_HUMAN PTGER2 Prostaglandin E2 receptor Prostanoid EP2 Receptor
Type:
Enzyme
Mol. Mass.:
39775.71
Organism:
Homo sapiens (Human)
Description:
P43116
Residue:
358
  
Inhibitor
Name:
BDBM50016954
Synonyms:
CHEMBL1628262
Type:
Small organic molecule
Emp. Form.:
C23H38O5
Mol. Mass.:
394.5448
SMILES:
CCCC1(CCC1)[C@@H](O)C\C=C\[C@H]1[C@H](O)CC(=O)[C@@H]1CCCCCCC(O)=O
: