Target
11-beta-hydroxysteroid dehydrogenase type 2
Ligand
BDBM50239401
Substrate
Meas. Tech.
ChEMBL_1364744 (CHEMBL3294005)
IC50
>3000±n/a nM
Citation
 Scott, JSGoldberg, FWTurnbull, AV Medicinal chemistry of inhibitors of 11ß-hydroxysteroid dehydrogenase type 1 (11ß-HSD1). J Med Chem 57:4466-86 (2014)  
Target
Name:
11-beta-hydroxysteroid dehydrogenase type 2
Synonyms:
11-DH2 11-beta-Hydroxysteroid Dehydrogenase 2 (11-beta-HSD2) 11-beta-hydroxysteroid dehydrogenase 2 11-beta-hydroxysteroid dehydrogenase type 2 (11-beta-HSD2) DHI2_HUMAN HSD11K SDR9C3
Type:
Enzyme
Mol. Mass.:
44141.72
Organism:
Homo sapiens (Human)
Description:
Purified recombinant human 11beta-HSD2.
Residue:
405
  
Inhibitor
Name:
BDBM50239401
Synonyms:
3-Adamantan-1-yl-6,7,8,9-tetrahydro-5H-[1,2,4]triazolo[4,3-a]azepine MERCK-544
Type:
Small organic molecule
Emp. Form.:
C17H25N3
Mol. Mass.:
271.4005
SMILES:
C1C2CC3CC1CC(C2)(C3)c1nnc2CCCCCn12
: