Target
Sphingosine kinase 2
Ligand
BDBM50393642
Substrate
Meas. Tech.
ChEMBL_1365137 (CHEMBL3292344)
Ki
9800±n/a nM
Citation
 Plano, DAmin, SSharma, AK Importance of sphingosine kinase (SphK) as a target in developing cancer therapeutics and recent developments in the synthesis of novel SphK inhibitors. J Med Chem 57:5509-24 (2014)  
Target
Name:
Sphingosine kinase 2
Synonyms:
SK 2 SPHK2 SPK 2 Sphingosine kinase types 2 (SphK2)
Type:
Protein
Mol. Mass.:
69221.44
Organism:
Homo sapiens (Human)
Description:
Q9NRA0
Residue:
654
  
Inhibitor
Name:
BDBM50393642
Synonyms:
CHEMBL2158685
Type:
Small organic molecule
Emp. Form.:
C23H25ClN2O
Mol. Mass.:
380.91
SMILES:
Clc1ccc(cc1)C12CC3CC(CC(C3)(C1)C(=O)NCc1ccncc1)C2
: