Target
NAD-dependent protein deacylase sirtuin-6
Ligand
BDBM50017341
Substrate
Meas. Tech.
ChEMBL_1362800 (CHEMBL3295497)
IC50
106000±n/a nM
Citation
 Parenti, MDGrozio, ABauer, IGaleno, LDamonte, PMillo, ESociali, GFranceschi, CBallestrero, ABruzzone, SDel Rio, ANencioni, A Discovery of novel and selective SIRT6 inhibitors. J Med Chem 57:4796-804 (2014)  
Target
Name:
NAD-dependent protein deacylase sirtuin-6
Synonyms:
NAD-dependent protein deacetylase sirtuin-6 Regulatory protein SIR2 homolog 6 SIR2L6 SIRT6 | Sirtuin-6 (SIRT6)
Type:
Protein
Mol. Mass.:
39133.03
Organism:
Homo sapiens (Human)
Description:
Q8N6T7
Residue:
355
  
Inhibitor
Name:
BDBM50017341
Synonyms:
CHEMBL3288034
Type:
Small organic molecule
Emp. Form.:
C19H14N4O5S
Mol. Mass.:
410.403
SMILES:
O=c1[nH]c2ccc(cc2c(=O)[nH]1)S(=O)(=O)Nc1ccc(Oc2cccnc2)cc1
: