Target
Coagulation factor X
Ligand
BDBM50017940
Substrate
Meas. Tech.
ChEMBL_1364435 (CHEMBL3294776)
Ki
876±n/a nM
Citation
 Goswami, RMukherjee, SGhadiyaram, CWohlfahrt, GSistla, RKNagaraj, JSatyam, LKSubbarao, KPalakurthy, RKGopinath, SKrishnamurthy, NRIkonen, TMoilanen, ASubramanya, HSKallio, PRamachandra, M Structure-guided discovery of 1,3,5 tri-substituted benzenes as potent and selective matriptase inhibitors exhibiting in vivo antitumor efficacy. Bioorg Med Chem 22:3187-203 (2014)  
Target
Name:
Coagulation factor X
Synonyms:
Coagulation factor X FA10_BOVIN | Factor Xa (fXa)
Type:
PROTEIN
Mol. Mass.:
54498.45
Organism:
Bos taurus
Description:
ChEMBL_1364435
Residue:
492
  
Inhibitor
Name:
BDBM50017940
Synonyms:
CHEMBL3289037
Type:
Small organic molecule
Emp. Form.:
C30H25N5O4S
Mol. Mass.:
551.616
SMILES:
NC(=N)c1ccc(Oc2cc(NS(=O)(=O)c3ccc4ccccc4c3)cc(Oc3ccc(cc3)C(N)=N)c2)cc1
: