Target
Coagulation factor X
Ligand
BDBM50017918
Substrate
Meas. Tech.
ChEMBL_1364435 (CHEMBL3294776)
Ki
1026±n/a nM
Citation
 Goswami, RMukherjee, SGhadiyaram, CWohlfahrt, GSistla, RKNagaraj, JSatyam, LKSubbarao, KPalakurthy, RKGopinath, SKrishnamurthy, NRIkonen, TMoilanen, ASubramanya, HSKallio, PRamachandra, M Structure-guided discovery of 1,3,5 tri-substituted benzenes as potent and selective matriptase inhibitors exhibiting in vivo antitumor efficacy. Bioorg Med Chem 22:3187-203 (2014)  
Target
Name:
Coagulation factor X
Synonyms:
Coagulation factor X FA10_BOVIN | Factor Xa (fXa)
Type:
PROTEIN
Mol. Mass.:
54498.45
Organism:
Bos taurus
Description:
ChEMBL_1364435
Residue:
492
  
Inhibitor
Name:
BDBM50017918
Synonyms:
CHEMBL3289026
Type:
Small organic molecule
Emp. Form.:
C29H32N6O5
Mol. Mass.:
544.6016
SMILES:
CCOC(=O)N1CCC(CC1)NC(=O)c1cc(Oc2ccc(cc2)C(N)=N)cc(Oc2ccc(cc2)C(N)=N)c1
: