Target
D(3) dopamine receptor
Ligand
BDBM85093
Substrate
Meas. Tech.
ChEMBL_1365237 (CHEMBL3292987)
Ki
2300±n/a nM
Citation
 Sampson, DZhu, XYEyunni, SVEtukala, JROfori, EBricker, BLamango, NSSetola, VRoth, BLAblordeppey, SY Identification of a new selective dopamine D4 receptor ligand. Bioorg Med Chem 22:3105-14 (2014)  
Target
Name:
D(3) dopamine receptor
Synonyms:
DOPAMINE D3 DRD3_HUMAN Dopamine D3 receptor (D3) Dopamine receptor Dopamine receptor D3
Type:
Mol. Mass.:
44243.43
Organism:
Homo sapiens (Human)
Description:
Residue:
400
  
Inhibitor
Name:
BDBM85093
Synonyms:
CAS_3853 CHEMBL555670 NSC_3853
Type:
Small organic molecule
Emp. Form.:
C18H19ClN4
Mol. Mass.:
326.823
SMILES:
Clc1ccc(cc1)N1CCN(Cc2c[nH]c3ncccc23)CC1
: