Target
Beta-glucosidase
Ligand
BDBM18351
Substrate
Meas. Tech.
ChEMBL_1366789 (CHEMBL3297224)
Ki
12000±n/a nM
Citation
 Zoidl, MMüller, BTorvisco, ATysoe, CBenazza, MSiriwardena, AWithers, SGWrodnigg, TM Concise synthesis of C-1-cyano-iminosugars via a new Staudinger/aza Wittig/Strecker multicomponent reaction strategy. Bioorg Med Chem Lett 24:2777-80 (2014)  
Target
Name:
Beta-glucosidase
Synonyms:
BGLS_RHIRD | cbg-1
Type:
PROTEIN
Mol. Mass.:
88266.88
Organism:
Agrobacterium tumefaciens
Description:
ChEMBL_1366789
Residue:
818
  
Inhibitor
Name:
BDBM18351
Synonyms:
(2R,3R,4R,5S)-2-(Hydroxymethyl)piperidine-3,4,5-triol, 10 1-Deoxynojirimycin CHEMBL307429 US9181184, 1 | dNM
Type:
natural product
Emp. Form.:
C6H13NO4
Mol. Mass.:
163.1717
SMILES:
OC[C@H]1NC[C@H](O)[C@@H](O)[C@@H]1O
: