Target
5-hydroxytryptamine receptor 2A
Ligand
BDBM50018031
Substrate
Meas. Tech.
ChEMBL_1366808 (CHEMBL3297243)
Ki
0.900000±n/a nM
Citation
 Kolaczkowski, MMarcinkowska, MBucki, APawlowski, MMitka, KJaskowska, JKowalski, PKazek, GSiwek, AWasik, AWesolowska, AMierzejewski, PBienkowski, P Novel arylsulfonamide derivatives with 5-HT6/5-HT7 receptor antagonism targeting behavioral and psychological symptoms of dementia. J Med Chem 57:4543-57 (2014)  
Target
Name:
5-hydroxytryptamine receptor 2A
Synonyms:
5-HT-2 5-HT2A 5-hydroxytryptamine receptor 2A (5HT-2A) 5HT2A_HUMAN HTR2A | Serotonin receptor 2A
Type:
undefined
Mol. Mass.:
52607.65
Organism:
Homo sapiens (Human)
Description:
P28223
Residue:
471
  
Inhibitor
Name:
BDBM50018031
Synonyms:
CHEMBL3289952
Type:
Small organic molecule
Emp. Form.:
C23H24N4O2S2
Mol. Mass.:
452.592
SMILES:
O=S(=O)(NCCN1CCN(CC1)c1nsc2ccccc12)c1ccc2ccccc2c1
: