Target
Beta-2 adrenergic receptor
Ligand
BDBM50419652
Substrate
Meas. Tech.
ChEMBL_1362117 (CHEMBL3294889)
EC50
0.063096±n/a nM
Citation
 Jacobsen, JRAggen, JBChurch, TJKlein, UPfeiffer, JWPulido-Rios, TMThomas, GRYu, CMoran, EJ Multivalent design of long-actingß(2)-adrenoceptor agonists incorporating biarylamines. Bioorg Med Chem Lett 24:2625-30 (2014)  
Target
Name:
Beta-2 adrenergic receptor
Synonyms:
ADRB2 ADRB2_HUMAN Beta-2 adrenoceptor | Beta-2 adrenoreceptor
Type:
Mol. Mass.:
46461.69
Organism:
Homo sapiens (Human)
Description:
P07550
Residue:
413
  
Inhibitor
Name:
BDBM50419652
Synonyms:
MILVETEROL
Type:
Small organic molecule
Emp. Form.:
C25H29N3O4
Mol. Mass.:
435.5155
SMILES:
O[C@@H](CNCCc1ccc(NC[C@H](O)c2ccccc2)cc1)c1ccc(O)c(NC=O)c1
: