Target
Beta-2 adrenergic receptor
Ligand
BDBM50018562
Substrate
Meas. Tech.
ChEMBL_1362118 (CHEMBL3294890)
Ki
251±n/a nM
Citation
 Jacobsen, JRAggen, JBChurch, TJKlein, UPfeiffer, JWPulido-Rios, TMThomas, GRYu, CMoran, EJ Multivalent design of long-actingß(2)-adrenoceptor agonists incorporating biarylamines. Bioorg Med Chem Lett 24:2625-30 (2014)  
Target
Name:
Beta-2 adrenergic receptor
Synonyms:
ADRB2 ADRB2_HUMAN Beta-2 adrenoceptor | Beta-2 adrenoreceptor
Type:
Mol. Mass.:
46461.69
Organism:
Homo sapiens (Human)
Description:
P07550
Residue:
413
  
Inhibitor
Name:
BDBM50018562
Synonyms:
CHEMBL3290996
Type:
Small organic molecule
Emp. Form.:
C25H28N2O5
Mol. Mass.:
436.5002
SMILES:
COC(=O)c1ccc(Nc2ccc(CCNCC(O)c3ccc(O)c(CO)c3)cc2)cc1
: