Target
Beta-1 adrenergic receptor
Ligand
BDBM50018598
Substrate
Meas. Tech.
ChEMBL_1362119 (CHEMBL3294891)
Ki
<10000±n/a nM
Citation
 Jacobsen, JRAggen, JBChurch, TJKlein, UPfeiffer, JWPulido-Rios, TMThomas, GRYu, CMoran, EJ Multivalent design of long-actingß(2)-adrenoceptor agonists incorporating biarylamines. Bioorg Med Chem Lett 24:2625-30 (2014)  
Target
Name:
Beta-1 adrenergic receptor
Synonyms:
ADRB1 ADRB1_HUMAN Beta-1 adrenoceptor | adrenergic Beta1
Type:
G Protein-Coupled Receptor (GPCR)
Mol. Mass.:
51338.40
Organism:
Homo sapiens (Human)
Description:
P08588
Residue:
477
  
Inhibitor
Name:
BDBM50018598
Synonyms:
CHEMBL3290979
Type:
Small organic molecule
Emp. Form.:
C29H37N3O4
Mol. Mass.:
491.6218
SMILES:
COc1ccc(CN2CCN(CC2)c2ccc(CCNCC(O)c3ccc(O)c(CO)c3)cc2)cc1
: