Target
Beta-1 adrenergic receptor
Ligand
BDBM50018607
Substrate
Meas. Tech.
ChEMBL_1362119 (CHEMBL3294891)
Ki
12589±n/a nM
Citation
 Jacobsen, JRAggen, JBChurch, TJKlein, UPfeiffer, JWPulido-Rios, TMThomas, GRYu, CMoran, EJ Multivalent design of long-actingß(2)-adrenoceptor agonists incorporating biarylamines. Bioorg Med Chem Lett 24:2625-30 (2014)  
Target
Name:
Beta-1 adrenergic receptor
Synonyms:
ADRB1 ADRB1_HUMAN Beta-1 adrenoceptor | adrenergic Beta1
Type:
G Protein-Coupled Receptor (GPCR)
Mol. Mass.:
51338.40
Organism:
Homo sapiens (Human)
Description:
P08588
Residue:
477
  
Inhibitor
Name:
BDBM50018607
Synonyms:
CHEMBL3290988
Type:
Small organic molecule
Emp. Form.:
C29H30N2O3
Mol. Mass.:
454.5601
SMILES:
OCc1cc(ccc1O)C(O)CNCCc1ccc(Nc2cccc(c2)-c2ccccc2)cc1
: