Target
11-beta-hydroxysteroid dehydrogenase 1
Ligand
BDBM50018798
Substrate
Meas. Tech.
ChEMBL_1362859 (CHEMBL3291633)
IC50
13±n/a nM
Citation
 Gillespie, PPietranico-Cole, SMyers, MBilotta, JAConde-Knape, KFotouhi, NGoodnow, RAGuertin, KRHamilton, MMHaynes, NELiu, BQi, LRen, YScott, NRSo, SSSpence, CTaub, RThakkar, KTilley, JWZwingelstein, C Discovery of camphor-derived pyrazolones as 11ß-hydroxysteroid dehydrogenase type 1 inhibitors. Bioorg Med Chem Lett 24:2707-11 (2014)  
Target
Name:
11-beta-hydroxysteroid dehydrogenase 1
Synonyms:
11-DH 11-beta-Hydroxysteroid Dehydrogenase 1 (11-beta-HSD1) 11-beta-hydroxysteroid dehydrogenase 1 (11HSD1) Corticosteroid 11-beta-dehydrogenase isozyme 1 (11-beta-HSD-1) Corticosteroid 11-beta-dehydrogenase isozyme 1 (11beta-HSD1) HSD11 HSD11L | SDR26C1
Type:
Enzyme
Mol. Mass.:
32409.16
Organism:
Homo sapiens (Human)
Description:
P28845
Residue:
292
  
Inhibitor
Name:
BDBM50018798
Synonyms:
CHEMBL3291342
Type:
Small organic molecule
Emp. Form.:
C20H25FN2O
Mol. Mass.:
328.4237
SMILES:
[H][C@@]12CC[C@@](C)(c3c1c(=O)n(-c1ccccc1F)n3C(C)C)C2(C)C
: