Target
11-beta-hydroxysteroid dehydrogenase 1
Ligand
BDBM50018795
Substrate
Meas. Tech.
ChEMBL_1362858 (CHEMBL3295808)
IC50
18±n/a nM
Citation
 Gillespie, PPietranico-Cole, SMyers, MBilotta, JAConde-Knape, KFotouhi, NGoodnow, RAGuertin, KRHamilton, MMHaynes, NELiu, BQi, LRen, YScott, NRSo, SSSpence, CTaub, RThakkar, KTilley, JWZwingelstein, C Discovery of camphor-derived pyrazolones as 11ß-hydroxysteroid dehydrogenase type 1 inhibitors. Bioorg Med Chem Lett 24:2707-11 (2014)  
Target
Name:
11-beta-hydroxysteroid dehydrogenase 1
Synonyms:
11-DH 11-beta-Hydroxysteroid Dehydrogenase 1 (11-beta-HSD1) Corticosteroid 11-beta-dehydrogenase isozyme 1 DHI1_RAT Hsd11b1
Type:
Enzyme
Mol. Mass.:
31889.48
Organism:
Rattus norvegicus (rat)
Description:
P16232
Residue:
288
  
Inhibitor
Name:
BDBM50018795
Synonyms:
CHEMBL3291339
Type:
Small organic molecule
Emp. Form.:
C19H24N2O
Mol. Mass.:
296.4067
SMILES:
[H][C@@]12CC[C@@](C)(c3c1c(=O)n(-c1ccccc1)n3CC)C2(C)C
: