Target
Tyrosine-protein kinase FRK
Ligand
BDBM50018830
Substrate
Meas. Tech.
ChEMBL_1363668 (CHEMBL3293410)
IC50
53±n/a nM
Citation
 Johnson, TWRichardson, PFBailey, SBrooun, ABurke, BJCollins, MRCui, JJDeal, JGDeng, YLDinh, DEngstrom, LDHe, MHoffman, JHoffman, RLHuang, QKania, RSKath, JCLam, HLam, JLLe, PTLingardo, LLiu, WMcTigue, MPalmer, CLSach, NWSmeal, TSmith, GLStewart, AETimofeevski, SZhu, HZhu, JZou, HYEdwards, MP Discovery of (10R)-7-amino-12-fluoro-2,10,16-trimethyl-15-oxo-10,15,16,17-tetrahydro-2H-8,4-(metheno)pyrazolo[4,3-h][2,5,11]-benzoxadiazacyclotetradecine-3-carbonitrile (PF-06463922), a macrocyclic inhibitor of anaplastic lymphoma kinase (ALK) and c-ros oncogene 1 (ROS1) with preclinical brain expo J Med Chem 57:4720-44 (2014)  
Target
Name:
Tyrosine-protein kinase FRK
Synonyms:
FRK FYN-related kinase PTK5 SRC | Tyrosine Kinase FRK
Type:
Tyrosine-protein kinase
Mol. Mass.:
58254.41
Organism:
Homo sapiens (Human)
Description:
P42685
Residue:
505
  
Inhibitor
Name:
BDBM50018830
Synonyms:
CHEMBL3286830 US10780082, Compound PF-06463922 | US11517561, Compound PF-06463922
Type:
Small organic molecule
Emp. Form.:
C21H19FN6O2
Mol. Mass.:
406.413
SMILES:
C[C@H]1Oc2cc(cnc2N)-c2c(CN(C)C(=O)c3ccc(F)cc13)nn(C)c2C#N
: