Target
Nuclear receptor subfamily 1 group I member 2
Ligand
BDBM50018938
Substrate
Meas. Tech.
ChEMBL_1364501 (CHEMBL3295049)
IC50
850±n/a nM
Citation
 Hodnik, ?Peterlin Ma?ic, LToma?ic, TSmodi?, DD'Amore, CFiorucci, SKikelj, D Bazedoxifene-scaffold-based mimetics of solomonsterols A and B as novel pregnane X receptor antagonists. J Med Chem 57:4819-33 (2014)  
Target
Name:
Nuclear receptor subfamily 1 group I member 2
Synonyms:
NR1I2 Orphan nuclear receptor PAR1 PXR SXR nuclear receptor subfamily 1 group I member 2 isoform 1
Type:
Nuclear receptor
Mol. Mass.:
49774.77
Organism:
Homo sapiens (Human)
Description:
O75469
Residue:
434
  
Inhibitor
Name:
BDBM50018938
Synonyms:
CHEMBL1445606
Type:
Small organic molecule
Emp. Form.:
C16H14N2O3S
Mol. Mass.:
314.359
SMILES:
Cc1cc(no1)-c1onc(C)c1C(=O)Sc1ccc(C)cc1
: