Target
Beta-glucuronidase
Ligand
BDBM50019165
Substrate
Meas. Tech.
ChEMBL_1362174 (CHEMBL3295183)
IC50
22200±n/a nM
Citation
 Khan, KMSaad, SMShaikh, NNHussain, SFakhri, MIPerveen, STaha, MChoudhary, MI Synthesis andß-glucuronidase inhibitory activity of 2-arylquinazolin-4(3H)-ones. Bioorg Med Chem 22:3449-54 (2014)  
Target
Name:
Beta-glucuronidase
Synonyms:
β-Glucuronidase Beta-G1 GUSB | beta-Glucuronidase (β-glucuronidase)
Type:
Protein
Mol. Mass.:
74736.05
Organism:
Homo sapiens (Human)
Description:
Residue:
651
  
Inhibitor
Name:
BDBM50019165
Synonyms:
2-(4'-Hydroxyphenyl)quinazolin-4(3H)-one (2) | CHEMBL3289108
Type:
Small organic molecule
Emp. Form.:
C14H10N2O2
Mol. Mass.:
238.2414
SMILES:
Oc1ccc(cc1)-c1nc2ccccc2c(=O)[nH]1
: