Target
Beta-glucuronidase
Ligand
BDBM50019170
Substrate
Meas. Tech.
ChEMBL_1362174 (CHEMBL3295183)
IC50
2800±n/a nM
Citation
 Khan, KMSaad, SMShaikh, NNHussain, SFakhri, MIPerveen, STaha, MChoudhary, MI Synthesis andß-glucuronidase inhibitory activity of 2-arylquinazolin-4(3H)-ones. Bioorg Med Chem 22:3449-54 (2014)  
Target
Name:
Beta-glucuronidase
Synonyms:
β-Glucuronidase Beta-G1 GUSB | beta-Glucuronidase (β-glucuronidase)
Type:
Protein
Mol. Mass.:
74736.05
Organism:
Homo sapiens (Human)
Description:
Residue:
651
  
Inhibitor
Name:
BDBM50019170
Synonyms:
2-(3'-Hydroxy-4'-methoxyphenyl)quinazolin-4(3H)-one (20) | CHEMBL3289112
Type:
Small organic molecule
Emp. Form.:
C15H12N2O3
Mol. Mass.:
268.2674
SMILES:
COc1ccc(cc1O)-c1nc2ccccc2c(=O)[nH]1
: