Target
Ectonucleotide pyrophosphatase/phosphodiesterase family member 1
Ligand
BDBM50019294
Substrate
Meas. Tech.
ChEMBL_1362542 (CHEMBL3293571)
Ki
685±n/a nM
Citation
 Nadel, YLecka, JGilad, YBen-David, GFörster, DReiser, GKenigsberg, SCamden, JWeisman, GASenderowitz, HSévigny, JFischer, B Highly potent and selective ectonucleotide pyrophosphatase/phosphodiesterase I inhibitors based on an adenosine 5'-(a or¿)-thio-(a,ß- orß,¿)-methylenetriphosphate scaffold. J Med Chem 57:4677-91 (2014)  
Target
Name:
Ectonucleotide pyrophosphatase/phosphodiesterase family member 1
Synonyms:
ENPP1 M6S1 PC1 | PDNP1
Type:
PROTEIN
Mol. Mass.:
104934.43
Organism:
Homo sapiens (Human)
Description:
ChEMBL_1448940
Residue:
925
  
Inhibitor
Name:
BDBM50019294
Synonyms:
CHEMBL3289394
Type:
Small organic molecule
Emp. Form.:
C11H16Cl2N5O11P3S
Mol. Mass.:
590.164
SMILES:
Nc1ncnc2n(cnc12)[C@@H]1O[C@H](CO[P@](O)(=S)OP(O)(=O)C(Cl)(Cl)P(O)(O)=O)[C@@H](O)[C@H]1O
: