Target
Potassium voltage-gated channel subfamily H member 2
Ligand
BDBM50019518
Substrate
Meas. Tech.
ChEMBL_1365780 (CHEMBL3296306)
IC50
>33000±n/a nM
Citation
 Naik, MHumnabadkar, VTantry, SJPanda, MNarayan, AGuptha, SPanduga, VManjrekar, PJena, LKKoushik, KShanbhag, GJatheendranath, SManjunatha, MRGorai, GBathula, CRudrapatna, SAchar, VSharma, SAmbady, AHegde, NMahadevaswamy, JKaur, PSambandamurthy, VKAwasthy, DNarayan, CRavishankar, SMadhavapeddi, PReddy, JPrabhakar, KSaralaya, RChatterji, MWhiteaker, JMcLaughlin, BChiarelli, LRRiccardi, GPasca, MRBinda, CNeres, JDhar, NSignorino-Gelo, FMcKinney, JDRamachandran, VShandil, RTommasi, RIyer, PSNarayanan, SHosagrahara, VKavanagh, SDinesh, NGhorpade, SR 4-aminoquinolone piperidine amides: noncovalent inhibitors of DprE1 with long residence time and potent antimycobacterial activity. J Med Chem 57:5419-34 (2014)  
Target
Name:
Potassium voltage-gated channel subfamily H member 2
Synonyms:
1,3-beta-glucan synthase component GLS2 ERG Eag-related protein 1 Ether-a-go-go-related gene (HERG) Ether-a-go-go-related gene potassium channel 1 Ether-a-go-go-related gene potassium channel 1 (hERG1) Ether-a-go-go-related protein 1 H-ERG KCNH2 Potassium voltage-gated channel subfamily H member 2 (hERG) Voltage-gated potassium channel subunit Kv11.1 hERG Potassium Channel 1 | putative potassium channel subunit
Type:
Multi-pass membrane protein
Mol. Mass.:
126672.65
Organism:
Homo sapiens (Human)
Description:
Q12809
Residue:
1159
  
Inhibitor
Name:
BDBM50019518
Synonyms:
CHEMBL3291066
Type:
Small organic molecule
Emp. Form.:
C21H24N6O3
Mol. Mass.:
408.4537
SMILES:
[H][C@]12CC[C@]([H])(C[C@@H](C1)Nc1cc(=O)n(C)c3nccnc13)N2C(=O)c1noc(C)c1C
: