Target
5-hydroxytryptamine receptor 2B
Ligand
BDBM50019926
Substrate
Meas. Tech.
ChEMBL_1362193 (CHEMBL3295454)
IC50
3700±n/a nM
Citation
 Bhattacharya, SKAndrews, KBeveridge, RCameron, KOChen, CDunn, MFernando, DGao, HHepworth, DJackson, VMKhot, VKong, JKosa, RELapham, KLoria, PMLondregan, ATMcClure, KFOrr, STPatel, JRose, CSaenz, JStock, IAStorer, GVanVolkenburg, MVrieze, DWang, GXiao, JZhang, Y Discovery of PF-5190457, a Potent, Selective, and Orally Bioavailable Ghrelin Receptor Inverse Agonist Clinical Candidate. ACS Med Chem Lett 5:474-9 (2014)  
Target
Name:
5-hydroxytryptamine receptor 2B
Synonyms:
5-HT-2B 5-hydroxytryptamine (serotonin) receptor 2B [Homo sapiens] 5-hydroxytryptamine receptor 2C (5HT2C) HTR2B Serotonin 2b (5-HT2b) receptor | Serotonin Receptor 2B
Type:
G Protein-Coupled Receptor (GPCR)
Mol. Mass.:
54312.47
Organism:
Homo sapiens (Human)
Description:
Receptor binding assays were performed using human clone stably expressed in CHO cells.
Residue:
481
  
Inhibitor
Name:
BDBM50019926
Synonyms:
CHEMBL3287218
Type:
Small organic molecule
Emp. Form.:
C29H32N6OS
Mol. Mass.:
512.669
SMILES:
Cc1cn2cc(CC(=O)N3CCC4(CN(C4)[C@@H]4CCc5cc(ccc45)-c4cc(C)ncn4)CC3)nc2s1
: