Target
Pyroglutamylated RF-amide peptide receptor
Ligand
BDBM50020010
Substrate
Meas. Tech.
ChEMBL_1363386 (CHEMBL3295521)
IC50
100±n/a nM
Citation
 Nordqvist, AKristensson, LJohansson, KEIsaksson da Silva, KFex, TTyrchan, CSvensson Henriksson, ANilsson, K New Hits as Antagonists of GPR103 Identified by HTS. ACS Med Chem Lett 5:527-32 (2014)  
Target
Name:
Pyroglutamylated RF-amide peptide receptor
Synonyms:
GPR103 QRFPR | QRFPR_HUMAN
Type:
Enzyme Catalytic Domain
Mol. Mass.:
49508.46
Organism:
Homo sapiens (Human)
Description:
GPR103 0 HUMAN::Q96P65
Residue:
431
  
Inhibitor
Name:
BDBM50020010
Synonyms:
CHEMBL3287586
Type:
Small organic molecule
Emp. Form.:
C18H22N2OS2
Mol. Mass.:
346.51
SMILES:
COc1ccc(NC(=N)c2ccsc2)cc1CSC1CCCC1
: