Target
Chloroquine resistance transporter
Ligand
BDBM50020157
Substrate
Meas. Tech.
ChEMBL_1364181 (CHEMBL3292896)
IC50
63000±n/a nM
Citation
 Deane, KJSummers, RLLehane, AMMartin, REBarrow, RA Chlorpheniramine Analogues Reverse Chloroquine Resistance in Plasmodium falciparum by Inhibiting PfCRT. ACS Med Chem Lett 5:576-81 (2014)  
Target
Name:
Chloroquine resistance transporter
Synonyms:
CRT PfCRT
Type:
PROTEIN
Mol. Mass.:
48687.29
Organism:
Plasmodium falciparum
Description:
ChEMBL_1364181
Residue:
424
  
Inhibitor
Name:
BDBM50020157
Synonyms:
CHEMBL3288457
Type:
Small organic molecule
Emp. Form.:
C16H19ClN2
Mol. Mass.:
274.788
SMILES:
CN(C)CCC(c1cccc(Cl)c1)c1ccccn1
: